BDBM313398 6-(2-cyanopropan-2-yl)- N-(6'-ethoxy-2-methyl- 5'-(3-methyloxetan-3- yl)-[3,3'-bipyridin]-5- yl)pyridazine-4- carboxamide::US10167279, Example 65
SMILES CCOc1ncc(cc1C1(C)COC1)-c1cc(NC(=O)c2cnnc(c2)C(C)(C)C#N)cnc1C
InChI Key InChIKey=YFRNBQDGZXGYJM-UHFFFAOYSA-N
Data  2 IC50
  Tab Delimited (TSV)   2D SDfile   Computed 3D by Vconf -m prep SDfile
Find this compound or compounds like it in BindingDB:
Activity Spreadsheet -- Enzyme Inhibition Constant Data from BindingDB
Found 2 hits for monomerid = 313398
TargetSerine/threonine-protein kinase B-raf [416-766,V600E](Homo sapiens (Human))
Novartis
US Patent
LigandPNGBDBM313398(6-(2-cyanopropan-2-yl)- N-(6'-ethoxy-2-methyl- 5'-...)
Affinity DataIC50:  7.13E+3nM. Assay description: Assay Materials: Assay buffer is 50 mM Tris, pH 7.5, 15 mM MgCl2, 0.01% Bovine Serum Albumin (BSA) and 1 mM dithiothreitol (DTT); Stop buffer is 60 m...
Ligand InfoPC cidPC sid
In DepthDetails US Patent
TargetRAF proto-oncogene serine/threonine-protein kinase(Homo sapiens (Human))
Novartis
US Patent
LigandPNGBDBM313398(6-(2-cyanopropan-2-yl)- N-(6'-ethoxy-2-methyl- 5'-...)
Affinity DataIC50:  1.14E+3nM. Assay description: Assay Materials: Assay buffer is 50 mM Tris, pH 7.5, 15 mM MgCl2, 0.01% Bovine Serum Albumin (BSA) and 1 mM dithiothreitol (DTT); Stop buffer is 60 m...
Ligand InfoPC cidPC sid
In DepthDetails US Patent