BDBM313483 3-(2-aminopropan-2-yl)- N-(5'-(3-fluorooxetan-3- yl)-6'-methoxy-2- methyl-[3,3'-bipyridin]- 5-yl)-5- (trifluoromethyl)benzamide::US10167279, Example 102
SMILES COc1ncc(cc1C1(F)COC1)-c1cc(NC(=O)c2cc(cc(c2)C(F)(F)F)C(C)(C)N)cnc1C
InChI Key InChIKey=MNOYMAISEXOXQM-UHFFFAOYSA-N
Data  2 IC50
  Tab Delimited (TSV)   2D SDfile   Computed 3D by Vconf -m prep SDfile
Find this compound or compounds like it in BindingDB:
Activity Spreadsheet -- Enzyme Inhibition Constant Data from BindingDB
Found 2 hits for monomerid = 313483
TargetSerine/threonine-protein kinase B-raf [416-766,V600E](Homo sapiens (Human))
Novartis
US Patent
LigandPNGBDBM313483(3-(2-aminopropan-2-yl)- N-(5'-(3-fluorooxetan-3- y...)
Affinity DataIC50:  1.32E+4nM. Assay description: Assay Materials: Assay buffer is 50 mM Tris, pH 7.5, 15 mM MgCl2, 0.01% Bovine Serum Albumin (BSA) and 1 mM dithiothreitol (DTT); Stop buffer is 60 m...
Ligand InfoPC cidPC sid
In DepthDetails US Patent
TargetRAF proto-oncogene serine/threonine-protein kinase(Homo sapiens (Human))
Novartis
US Patent
LigandPNGBDBM313483(3-(2-aminopropan-2-yl)- N-(5'-(3-fluorooxetan-3- y...)
Affinity DataIC50:  2.68E+3nM. Assay description: Assay Materials: Assay buffer is 50 mM Tris, pH 7.5, 15 mM MgCl2, 0.01% Bovine Serum Albumin (BSA) and 1 mM dithiothreitol (DTT); Stop buffer is 60 m...
Ligand InfoPC cidPC sid
In DepthDetails US Patent