BDBM313630 6-(tert-butyl)-2- hydroxy-N-(3-(2-(2- hydroxyethoxy)-6- (tetrahydro-2H-pyran-4- yl)pyridin-4-yl)-4- methylphenyl)pyrimidine- 4-carboxamide::US10167279, Example 256
SMILES Cc1ccc(NC(=O)c2cc(nc(O)n2)C(C)(C)C)cc1-c1cc(OCCO)nc(c1)C1CCOCC1
InChI Key InChIKey=JFRFCXCIYGZNJG-UHFFFAOYSA-N
Data  1 IC50
  Tab Delimited (TSV)   2D SDfile   Computed 3D by Vconf -m prep SDfile
Find this compound or compounds like it in BindingDB:
Activity Spreadsheet -- Enzyme Inhibition Constant Data from BindingDB
Found 1 hit for monomerid = 313630
TargetRAF proto-oncogene serine/threonine-protein kinase(Homo sapiens (Human))
Novartis
US Patent
LigandPNGBDBM313630(6-(tert-butyl)-2- hydroxy-N-(3-(2-(2- hydroxyethox...)
Affinity DataIC50:  100nM. Assay description: Assay Materials: Assay buffer is 50 mM Tris, pH 7.5, 15 mM MgCl2, 0.01% Bovine Serum Albumin (BSA) and 1 mM dithiothreitol (DTT); Stop buffer is 60 m...
Ligand InfoPC cidPC sid
In DepthDetails US Patent