BDBM31390 terephthalamide scaffold, 37
SMILES CCN(CC)C(=O)c1ccc(C(=O)N[C@@H](C)C(=O)OC)c(OC(C)C)c1
InChI Key InChIKey=XNNHWNQIKUKNNJ-ZDUSSCGKSA-N
Data  1 KI
  Tab Delimited (TSV)   2D SDfile   Computed 3D by Vconf -m prep SDfile
Find this compound or compounds like it in BindingDB:
Activity Spreadsheet -- Enzyme Inhibition Constant Data from BindingDB
Found 1 hit for monomerid = 31390
TargetBcl-2-like protein 1(Homo sapiens (Human))
Yale University
LigandPNGBDBM31390(terephthalamide scaffold, 37)
Affinity DataKi:  2.44E+3nM ΔG°:  -7.65kcal/molepH: 7.4 T: 2°C. Assay description: Fluorescence polarization experiments were conducted on a Photon Technology International instrument using a 0.3 cm path length cuvette. Spectra were...
In DepthDetails ArticlePubMed