BDBM31409 terphenyl scaffold, 17
SMILES CC(C)Cc1cc(ccc1OCC(O)=O)-c1ccc(cc1Cc1ccc2ccccc2c1)-c1ccc(CCC(O)=O)cc1CC(C)C
InChI Key InChIKey=SEBFHAYMLVJLLK-UHFFFAOYSA-N
Data  1 KI
  Tab Delimited (TSV)   2D SDfile   Computed 3D by Vconf -m prep SDfile
Find this compound or compounds like it in BindingDB:
Activity Spreadsheet -- Enzyme Inhibition Constant Data from BindingDB
Found 1 hit for monomerid = 31409
TargetBcl-2-like protein 1(Homo sapiens (Human))
Yale University
LigandPNGBDBM31409(terphenyl scaffold, 17)
Affinity DataKi:  2.50E+3nM ΔG°:  -7.64kcal/molepH: 7.4 T: 2°C. Assay description: Fluorescence polarization experiments were conducted on a Photon Technology International instrument using a 0.3 cm path length cuvette. Spectra were...
In DepthDetails ArticlePubMed