BDBM31411 terphenyl scaffold, 19
SMILES CC(C)Cc1cc(CCC(O)=O)ccc1-c1ccc(c(CC(C)C)c1)-c1ccc(OCC(O)=O)c(Cc2cccc3ccccc23)c1
InChI Key InChIKey=AFKQCBJIYZSOOP-UHFFFAOYSA-N
Data  1 KI
  Tab Delimited (TSV)   2D SDfile   Computed 3D by Vconf -m prep SDfile
Find this compound or compounds like it in BindingDB:
Activity Spreadsheet -- Enzyme Inhibition Constant Data from BindingDB
Found 1 hit for monomerid = 31411
TargetBcl-2-like protein 1(Homo sapiens (Human))
Yale University
LigandPNGBDBM31411(terphenyl scaffold, 19)
Affinity DataKi:  2.70E+3nM ΔG°:  -7.59kcal/molepH: 7.4 T: 2°C. Assay description: Fluorescence polarization experiments were conducted on a Photon Technology International instrument using a 0.3 cm path length cuvette. Spectra were...
In DepthDetails ArticlePubMed