BDBM315382 US10172856, Example 34
SMILES Cc1cc(ccc1N(Cc1ccon1)c1ccnc(N)n1)S(F)(F)(F)(F)F
InChI Key InChIKey=QYGPRFVTXMBFKN-UHFFFAOYSA-N
Data  1 KI
  Tab Delimited (TSV)   2D SDfile   Computed 3D by Vconf -m prep SDfile
Find this compound or compounds like it in BindingDB:
Activity Spreadsheet -- Enzyme Inhibition Constant Data from BindingDB
Found 1 hit for monomerid = 315382
TargetHistamine H4 receptor(Homo sapiens (Human))
Janssen Pharmaceutica
US Patent
LigandPNGBDBM315382(US10172856, Example 34)
Affinity DataKi:  14nM. Assay description: Receptor binding was assessed using isolated plasma membranes from SKNMC neuroblastoma cell lines stably expressing recombinant human H4 receptor. To...
Ligand InfoPC cidPC sid
In DepthDetails US Patent