BDBM31604 methyl substituted pyrazole, 25
SMILES Cn1cc(c(n1)-c1ccc(OCc2cnc3ccccc3n2)cc1)-c1ccncc1
InChI Key InChIKey=ZMKCAJWGTIMPTC-UHFFFAOYSA-N
Data  1 IC50
  Tab Delimited (TSV)   2D SDfile   Computed 3D by Vconf -m prep SDfile
Find this compound or compounds like it in BindingDB:
Activity Spreadsheet -- Enzyme Inhibition Constant Data from BindingDB
Found 1 hit for monomerid = 31604
LigandPNGBDBM31604(methyl substituted pyrazole, 25)
Affinity DataIC50:  5.09nMpH: 7.5 T: 2°C. Assay description: PDE activity was measured using a plate-based Scintillation Proximity Assay (SPA). For competitive enzyme inhibition assays, the substrate [3H]cAMP c...
In DepthDetails ArticlePubMed