BDBM316345 cis-N-tert-Butyl-2-[2-(3-chlorophenyl)-4-oxo-6-[3-(1-piperidylmethyl)cyclobutyl]-quinazolin-3-yl]acetamide::US9617226, Example 26
SMILES CC(C)(C)NC(=O)Cn1c(nc2ccc(cc2c1=O)[C@@H]1C[C@H](CN2CCCCC2)C1)-c1cccc(Cl)c1
InChI Key InChIKey=FOTUMCZCISRQSX-UHGJSFDGSA-N
Data  1 KI
  Tab Delimited (TSV)   2D SDfile   Computed 3D by Vconf -m prep SDfile
Find this compound or compounds like it in BindingDB:
Activity Spreadsheet -- Enzyme Inhibition Constant Data from BindingDB
Found 1 hit for monomerid = 316345
TargetVasopressin V1a receptor(Homo sapiens (Human))
Abbvie Deutschland
US Patent
LigandPNGBDBM316345( cis-N-tert-Butyl-2-[2-(3-chlorophenyl)-4-oxo-6-[3...)
Affinity DataKi: <1nM. Assay description: The binding assay was carried out by the method based on that of Tahara et al. (Tahara A et al., Brit. J. Pharmacol. 125, 1463-1470 (1998)).The incub...
Ligand InfoPC cidPC sid
In DepthDetails US Patent