BDBM317254 US9617282, Example 23
SMILES CN1CCN(CC1)C(=O)c1ccc2OCCCCCNc3cc(ccn3)-c3nc(cs3)C(=O)Nc2c1
InChI Key InChIKey=QGBBOVLJLBDVEU-UHFFFAOYSA-N
Data  1 IC50
  Tab Delimited (TSV)   2D SDfile   Computed 3D by Vconf -m prep SDfile
Find this compound or compounds like it in BindingDB:
Activity Spreadsheet -- Enzyme Inhibition Constant Data from BindingDB
Found 1 hit for monomerid = 317254
TargetInterleukin-1 receptor-associated kinase 4(Homo sapiens (Human))
Biogen Ma
US Patent
LigandPNGBDBM317254(US9617282, Example 23)
Affinity DataIC50: <100nM. Assay description: The biochemical assay is in a AlphaScreen format. The kinase reaction is based on the IRAK-4 phosphorylation of a biotin labeled peptide. The phospho...
Ligand InfoPC cidPC sid
In DepthDetails US Patent