BDBM317326 US9617282, Example 99
SMILES Cn1cc2NC(=O)c3cn(COCCS(C)(C)C)c(n3)-c3ccnc(CCCCCNC(=O)c2n1)c3
InChI Key InChIKey=OIDXKRRWAWHSET-UHFFFAOYSA-N
Data  1 IC50
  Tab Delimited (TSV)   2D SDfile   Computed 3D by Vconf -m prep SDfile
Find this compound or compounds like it in BindingDB:
Activity Spreadsheet -- Enzyme Inhibition Constant Data from BindingDB
Found 1 hit for monomerid = 317326
TargetInterleukin-1 receptor-associated kinase 4(Homo sapiens (Human))
Biogen Ma
US Patent
LigandPNGBDBM317326(US9617282, Example 99)
Affinity DataIC50: <1.00E+4nM. Assay description: The biochemical assay is in a AlphaScreen format. The kinase reaction is based on the IRAK-4 phosphorylation of a biotin labeled peptide. The phospho...
Ligand InfoPC cidPC sid
In DepthDetails US Patent