BDBM317336 US9617282, Example 109
SMILES O=C1NCCOCCOc2cc(ccn2)-c2nc(cs2)C(=O)Nc2cnn(CCN3CCNCC3)c12
InChI Key InChIKey=GNCXRRDRNBXROZ-UHFFFAOYSA-N
Data  1 IC50
  Tab Delimited (TSV)   2D SDfile   Computed 3D by Vconf -m prep SDfile
Find this compound or compounds like it in BindingDB:
Activity Spreadsheet -- Enzyme Inhibition Constant Data from BindingDB
Found 1 hit for monomerid = 317336
TargetInterleukin-1 receptor-associated kinase 4(Homo sapiens (Human))
Biogen Ma
US Patent
LigandPNGBDBM317336(US9617282, Example 109)
Affinity DataIC50: <1.00E+4nM. Assay description: The biochemical assay is in a AlphaScreen format. The kinase reaction is based on the IRAK-4 phosphorylation of a biotin labeled peptide. The phospho...
Ligand InfoPC cidPC sid
In DepthDetails US Patent