BDBM3178 3-(1-Methyl-3-indolyl)-4-[1-[3-(2-nitroguanidino)propyl]-3-indolyl]-1H-pyrrole-2,5-dione::3-(3-{3-[4-(1-methyl-1H-indol-3-yl)-2,5-dioxo-2,5-dihydro-1H-pyrrol-3-yl]-1H-indol-1-yl}propyl)-2-nitroguanidine::Bisindolylmaleimide 12::Ro 31-8161
SMILES Cn1cc(C2=C(C(=O)NC2=O)c2cn(CCCN=C(N)N[N+]([O-])=O)c3ccccc23)c2ccccc12
InChI Key InChIKey=QWOYFIJNWGMAQA-UHFFFAOYSA-N
Data  2 IC50
  Tab Delimited (TSV)   2D SDfile   Computed 3D by Vconf -m prep SDfile
Find this compound or compounds like it in BindingDB:
Activity Spreadsheet -- Enzyme Inhibition Constant Data from BindingDB
Found 2 hits for monomerid = 3178
TargetcAMP-dependent protein kinase catalytic subunit alpha(Bos taurus (bovine))
Roche Products
LigandPNGBDBM3178(3-(1-Methyl-3-indolyl)-4-[1-[3-(2-nitroguanidino)p...)
Affinity DataIC50:  4.90E+3nM. Assay description: The activity of PKA, activated by cAMP, is measured by its ability to transfer phosphate from [gamma-32P]ATP to histone.
In DepthDetails ArticlePubMed
TargetProtein kinase C beta type(Rattus norvegicus (rat))
Roche Products
LigandPNGBDBM3178(3-(1-Methyl-3-indolyl)-4-[1-[3-(2-nitroguanidino)p...)
Affinity DataIC50:  26nM. Assay description: The activity of PKC, activated by phosphatidylerine and Ca2+, is measured by its ability to transfer phosphate from [gamma-32P]ATP to lysine-rich his...
In DepthDetails ArticlePubMed