BDBM319717 6-(2-(4-(benzo[b]thiophen-4-yl)piperidin-1-yl)ethyl)-3,4-dihydroquinolin-2(1H)-one::US10174011, Example 98
SMILES O=C1CCc2cc(CCN3CCC(CC3)c3cccc4sccc34)ccc2N1
InChI Key InChIKey=PEQHATYGQMKPDM-UHFFFAOYSA-N
Data  2 IC50  1 EC50
  Tab Delimited (TSV)   2D SDfile   Computed 3D by Vconf -m prep SDfile
Find this compound or compounds like it in BindingDB:
Activity Spreadsheet -- Enzyme Inhibition Constant Data from BindingDB
Found 3 hits for monomerid = 319717
Target5-hydroxytryptamine receptor 1A(Homo sapiens (Human))
Shanghai Institute Of Material Medica, Chinese Academy Of Sciences
US Patent
LigandPNGBDBM319717(6-(2-(4-(benzo[b]thiophen-4-yl)piperidin-1-yl)ethy...)
Affinity DataEC50:  2.90nM. Assay description: The 5-HT1A receptor agonism activity test (The agonism activity of test compounds on 5-HT1A receptor expressing human recombinant 5-HT1A receptor in ...
Ligand InfoPC cidPC sid
In DepthDetails US Patent
Target5-hydroxytryptamine receptor 2A(Homo sapiens (Human))
Shanghai Institute Of Material Medica, Chinese Academy Of Sciences
US Patent
LigandPNGBDBM319717(6-(2-(4-(benzo[b]thiophen-4-yl)piperidin-1-yl)ethy...)
Affinity DataIC50:  185nM. Assay description: The 5-HT2A receptor antagonism activity test (The antagonism activity of test compounds on 5-HT2A receptor expressing human recombinant 5-HT2A recept...
Ligand InfoPC cidPC sid
In DepthDetails US Patent
TargetD(2) dopamine receptor(Homo sapiens (Human))
Shanghai Institute Of Material Medica, Chinese Academy Of Sciences
US Patent
LigandPNGBDBM319717(6-(2-(4-(benzo[b]thiophen-4-yl)piperidin-1-yl)ethy...)
Affinity DataIC50:  12.4nM. Assay description: The D2 receptor antagonism activity test (The antagonism activity of test compounds on D2 receptor expressing human recombinant D2 receptor in HEK293...
Ligand InfoPC cidPC sid
In DepthDetails US Patent