BDBM31976 Dipeptidyl nitrile inhibitor, 9
SMILES Cc1ccccc1C(=O)N[C@@H](Cc1cccc(Cl)c1)C(=O)NCC#N
InChI Key InChIKey=UTKYXGXWEJOOHR-KRWDZBQOSA-N
Data  5 IC50
  Tab Delimited (TSV)   2D SDfile   Computed 3D by Vconf -m prep SDfile
Find this compound or compounds like it in BindingDB:
Activity Spreadsheet -- Enzyme Inhibition Constant Data from BindingDB
Found 5 hits for monomerid = 31976
TargetProcathepsin L [114-333,T223A](Homo sapiens (Human))
Astrazeneca
LigandPNGBDBM31976(Dipeptidyl nitrile inhibitor, 9)
Affinity DataIC50:  794nMpH: 7.0 T: 2°C. Assay description: IC50 values for inhibition of Cathepsins were determined from dose dependent inhibition of cleavage of fluorogenic, AMC-tagged, peptide substrates.
In DepthDetails ArticlePubMed
TargetCathepsin L2(Homo sapiens (Human))
Astrazeneca
LigandPNGBDBM31976(Dipeptidyl nitrile inhibitor, 9)
Affinity DataIC50:  5.01E+3nM. Assay description: IC50 values for inhibition of Cathepsins were determined from dose dependent inhibition of cleavage of fluorogenic, AMC-tagged, peptide substrates.
In DepthDetails ArticlePubMed
TargetCathepsin B(Homo sapiens (Human))
Astrazeneca
LigandPNGBDBM31976(Dipeptidyl nitrile inhibitor, 9)
Affinity DataIC50: >1.00E+4nM. Assay description: IC50 values for inhibition of Cathepsins were determined from dose dependent inhibition of cleavage of fluorogenic, AMC-tagged, peptide substrates.
In DepthDetails ArticlePubMed
TargetCathepsin K(Homo sapiens (Human))
Astrazeneca
LigandPNGBDBM31976(Dipeptidyl nitrile inhibitor, 9)
Affinity DataIC50:  5.01E+3nM. Assay description: IC50 values for inhibition of Cathepsins were determined from dose dependent inhibition of cleavage of fluorogenic, AMC-tagged, peptide substrates.
In DepthDetails ArticlePubMed
TargetCathepsin S(Homo sapiens (Human))
Astrazeneca
LigandPNGBDBM31976(Dipeptidyl nitrile inhibitor, 9)
Affinity DataIC50:  1.59E+3nM. Assay description: IC50 values for inhibition of Cathepsins were determined from dose dependent inhibition of cleavage of fluorogenic, AMC-tagged, peptide substrates.
In DepthDetails ArticlePubMed