BDBM32007 2-(6-methyl-2-phenacylsulfanyl-pyrimidin-4-yl)sulfanylethanamide::2-(6-methyl-2-phenacylsulfanylpyrimidin-4-yl)sulfanylacetamide::2-[6-Methyl-2-(2-oxo-2-phenyl-ethylsulfanyl)-pyrimidin-4-ylsulfanyl]-acetamide::2-[[6-methyl-2-(phenacylthio)-4-pyrimidinyl]thio]acetamide::2-[[6-methyl-2-(phenacylthio)pyrimidin-4-yl]thio]acetamide::MLS000068716::SMR000001750::cid_652313
SMILES Cc1cc(SCC(N)=O)nc(SCC(=O)c2ccccc2)n1
InChI Key InChIKey=DAROBQBBWUPLNL-UHFFFAOYSA-N
Data  2 KI  3 IC50
  Tab Delimited (TSV)   2D SDfile   Computed 3D by Vconf -m prep SDfile
Find this compound or compounds like it in BindingDB:
Activity Spreadsheet -- Enzyme Inhibition Constant Data from BindingDB
Found 5 hits for monomerid = 32007
TargetN-formyl peptide receptor 2(Homo sapiens (Human))
Nmmlsc
Curated by PubChem BioAssay
LigandPNGBDBM32007(2-(6-methyl-2-phenacylsulfanyl-pyrimidin-4-yl)sulf...)
Affinity DataKi: >4.03E+4nM. Assay description: University of New Mexico Assay Overview Assay Support: NIH 1R03MH076381-01 Assay for Formylpeptide Receptor Family Ligands PI: Bruce S. Edwards, Ph....
In DepthDetails PCBioAssay
TargetfMet-Leu-Phe receptor(Homo sapiens (Human))
Nmmlsc
Curated by PubChem BioAssay
LigandPNGBDBM32007(2-(6-methyl-2-phenacylsulfanyl-pyrimidin-4-yl)sulf...)
Affinity DataKi: >4.37E+4nM. Assay description: University of New Mexico Assay Overview: Assay Support: NIH 1R03MH076381-01 Assay for Formylpeptide Receptor Family Ligands PI: Bruce S. Edwards, Ph...
In DepthDetails PCBioAssay
TargetN-formyl peptide receptor 2(Homo sapiens (Human))
Nmmlsc
Curated by PubChem BioAssay
LigandPNGBDBM32007(2-(6-methyl-2-phenacylsulfanyl-pyrimidin-4-yl)sulf...)
Affinity DataIC50: >6.67E+4nM. Assay description: University of New Mexico Assay Overview Assay Support: NIH 1R03MH076381-01 Assay for Formylpeptide Receptor Family Ligands PI: Bruce S. Edwards, Ph....
In DepthDetails PCBioAssay
TargetHeat shock protein HSP 90-alpha(Homo sapiens (Human))
Emory University
Curated by PubChem BioAssay
LigandPNGBDBM32007(2-(6-methyl-2-phenacylsulfanyl-pyrimidin-4-yl)sulf...)
Affinity DataIC50:  5.00E+4nMpH: 7.4 T: 2°C. Assay description: A fluorescence polarization based HTS assay has been developed and optimized for the identification of Hsp90 inhibitors by using tumor cell lysate Hs...
In DepthDetails PCBioAssay
TargetfMet-Leu-Phe receptor(Homo sapiens (Human))
Nmmlsc
Curated by PubChem BioAssay
LigandPNGBDBM32007(2-(6-methyl-2-phenacylsulfanyl-pyrimidin-4-yl)sulf...)
Affinity DataIC50: >6.67E+4nM. Assay description: University of New Mexico Assay Overview: Assay Support: NIH 1R03MH076381-01 Assay for Formylpeptide Receptor Family Ligands PI: Bruce S. Edwards, Ph...
In DepthDetails PCBioAssay