BDBM320799 (R)- or (S)-1-(1-(4-(1,1- Difluoroethyl)phenyl)propyl)-6- (dimethylamino)-3-(fluoromethyl)-1H- pyrazolo[3,4-d]pyrimidin-4(5H)-one::US10174037, Example 204::US10174037, Example 205
SMILES CCC(c1ccc(cc1)C(C)(F)F)n1nc(CF)c2c1nc([nH]c2=O)N(C)C
InChI Key
Data  3 KI
  Tab Delimited (TSV)   2D SDfile   Computed 3D by Vconf -m prep SDfile
Find this compound or compounds like it in BindingDB:
Activity Spreadsheet -- Enzyme Inhibition Constant Data from BindingDB
Found 3 hits for monomerid = 320799
TargetcGMP-dependent 3',5'-cyclic phosphodiesterase(Homo sapiens (Human))
Merck Sharp & Dohme
US Patent
LigandPNGBDBM320799((R)- or (S)-1-(1-(4-(1,1- Difluoroethyl)phenyl)pro...)
Affinity DataKi:  0.0380nM. Assay description: Performed by Lab B. The activity of the compounds in accordance with the present invention as PDE2 inhibitors may be readily determined using a fluor...
Ligand InfoPC cidPC sid
In DepthDetails US Patent
TargetPhosphodiesterase(Macaca mulatta (Rhesus macaque))
Merck Sharp & Dohme
US Patent
LigandPNGBDBM320799((R)- or (S)-1-(1-(4-(1,1- Difluoroethyl)phenyl)pro...)
Affinity DataKi:  0.0720nM. Assay description: Performed by Lab B. The activity of the compounds in accordance with the present invention as PDE2 inhibitors may be readily determined using a fluor...
Ligand InfoPC cidPC sid
In DepthDetails US Patent
TargetcGMP-dependent 3',5'-cyclic phosphodiesterase(Homo sapiens (Human))
Merck Sharp & Dohme
US Patent
LigandPNGBDBM320799((R)- or (S)-1-(1-(4-(1,1- Difluoroethyl)phenyl)pro...)
Affinity DataKi:  1.40nM. Assay description: Performed by Lab B. The activity of the compounds in accordance with the present invention as PDE2 inhibitors may be readily determined using a fluor...
Ligand InfoPC cidPC sid
In DepthDetails US Patent