BDBM32160 N-[4-amino-3-(2-hydroxyphenyl)phenyl]-2,5-dichloro-benzenesulfonamide::N-[4-amino-3-(2-hydroxyphenyl)phenyl]-2,5-dichlorobenzenesulfonamide::N-[4-azanyl-3-(2-hydroxyphenyl)phenyl]-2,5-bis(chloranyl)benzenesulfonamide::TG2-71-2::cid_16072254
SMILES Nc1ccc(NS(=O)(=O)c2cc(Cl)ccc2Cl)cc1-c1ccccc1O
InChI Key InChIKey=KDHXYGSAGGQFCL-UHFFFAOYSA-N
Data  2 IC50
  Tab Delimited (TSV)   2D SDfile   Computed 3D by Vconf -m prep SDfile
Find this compound or compounds like it in BindingDB:
Activity Spreadsheet -- Enzyme Inhibition Constant Data from BindingDB
Found 2 hits for monomerid = 32160
TargetHeat shock protein HSP 90-alpha(Homo sapiens (Human))
Emory University
Curated by PubChem BioAssay
LigandPNGBDBM32160(N-[4-amino-3-(2-hydroxyphenyl)phenyl]-2,5-dichloro...)
Affinity DataIC50: >6.00E+4nM. Assay description: Emory Chemistry-Biology Discovery Center Assay Overview: MLSCN Grant: 1 X01MH78953-01 Hsp90 is a chaperon with important roles in maintaining transfo...
In DepthDetails PCBioAssay
TargetHeat shock protein HSP 90-alpha(Homo sapiens (Human))
Emory University
Curated by PubChem BioAssay
LigandPNGBDBM32160(N-[4-amino-3-(2-hydroxyphenyl)phenyl]-2,5-dichloro...)
Affinity DataIC50:  5.00E+4nMpH: 7.4 T: 2°C. Assay description: A fluorescence polarization based HTS assay has been developed and optimized for the identification of Hsp90 inhibitors by using tumor cell lysate Hs...
In DepthDetails PCBioAssay