BDBM322094 1-{5-[(2,5-difluorobenzyl)oxy]-1-(2,2-dimethylpropyl)-1H-pyrazol-3-yl}-N-methylmethanamine::US10183913, Example 258::US11312688, Example 258::US11576897, Example 258
SMILES CNCc1cc(OCc2cc(F)ccc2F)n(CC(C)(C)C)n1
InChI Key InChIKey=ZEOZGDUGZVKRTI-UHFFFAOYSA-N
Data  7 KI  1 IC50
  Tab Delimited (TSV)   2D SDfile   Computed 3D by Vconf -m prep SDfile
Find this compound or compounds like it in BindingDB:
Activity Spreadsheet -- Enzyme Inhibition Constant Data from BindingDB
Found 8 hits for monomerid = 322094
TargetSodium-dependent serotonin transporter(Homo sapiens (Human))
Sumitomo Dainippon Pharma
US Patent
LigandPNGBDBM322094(1-{5-[(2,5-difluorobenzyl)oxy]-1-(2,2-dimethylprop...)
Affinity DataKi:  0.660nM. Assay description: The [3H] citalopram binding was measured according to the method disclosed in Owens M. J. et al., J. Pharm. Exp. Ther., 283, 1305-1322 (1997). In spe...
Ligand InfoPC cidPC sid
In DepthDetails US Patent
TargetSodium-dependent serotonin transporter(Homo sapiens (Human))
Sumitomo Dainippon Pharma
US Patent
LigandPNGBDBM322094(1-{5-[(2,5-difluorobenzyl)oxy]-1-(2,2-dimethylprop...)
Affinity DataKi:  0.660nM. Assay description: The [3H] citalopram binding was measured according to the method disclosed in Owens M. J. et al., J. Pharm. Exp. Ther., 283, 1305-1322 (1997). In spe...
Ligand InfoPC cidPC sid
In DepthDetails US Patent
TargetSodium-dependent serotonin transporter(Homo sapiens (Human))
Sumitomo Dainippon Pharma
US Patent
LigandPNGBDBM322094(1-{5-[(2,5-difluorobenzyl)oxy]-1-(2,2-dimethylprop...)
Affinity DataKi:  0.660nM. Assay description: Specifically, a solution containing 50 μL of [3H]-citalopram (GE Healthcare) diluted with SERT buffer (50 mmol/L Tris-HCl (pH=7.4) containing 12...
Ligand InfoPC cidPC sid
In DepthDetails US Patent
Target5-hydroxytryptamine receptor 2A(Homo sapiens (Human))
Sumitomo Pharma
US Patent
LigandPNGBDBM322094(1-{5-[(2,5-difluorobenzyl)oxy]-1-(2,2-dimethylprop...)
Affinity DataKi:  7.5nM. Assay description: 5-HT2A: A solution containing 50 μL of [H]-ketanserin (the final concentration: 1 nM), 2 μL of a solution of a test compound in DMSO or a s...
Ligand InfoPC cidPC sid
In DepthDetails US Patent
Target5-hydroxytryptamine receptor 2C(Homo sapiens (Human))
Sumitomo Pharma
US Patent
LigandPNGBDBM322094(1-{5-[(2,5-difluorobenzyl)oxy]-1-(2,2-dimethylprop...)
Affinity DataKi:  16nM. Assay description: 5-HT2C: A solution containing 50 μL of [H]-mesulergine (GE Healthcare) diluted with 50 mmol/L Tris-HCl (pH=7.4) (the final concentration: about ...
Ligand InfoPC cidPC sid
In DepthDetails US Patent
Target5-hydroxytryptamine receptor 2C(Homo sapiens (Human))
Sumitomo Pharma
US Patent
LigandPNGBDBM322094(1-{5-[(2,5-difluorobenzyl)oxy]-1-(2,2-dimethylprop...)
Affinity DataKi:  16nM. Assay description: A solution of 200 μL in total was prepared by mixing 50 μL of [3H] mesulergine (manufactured by GE Healthcare) diluted with 50 mmol/L Tris-...
Ligand InfoPC cidPC sid
In DepthDetails US Patent
Target5-hydroxytryptamine receptor 2C(Homo sapiens (Human))
Sumitomo Pharma
US Patent
LigandPNGBDBM322094(1-{5-[(2,5-difluorobenzyl)oxy]-1-(2,2-dimethylprop...)
Affinity DataKi:  16nM. Assay description: A solution of 200 μL in total was prepared by mixing 50 μL of [3H] mesulergine (manufactured by GE Healthcare) diluted with 50 mmol/L Tris-...
Ligand InfoPC cidPC sid
In DepthDetails US Patent
TargetD(2) dopamine receptor(Rattus norvegicus (rat))
Sumitomo Pharma
US Patent
LigandPNGBDBM322094(1-{5-[(2,5-difluorobenzyl)oxy]-1-(2,2-dimethylprop...)
Affinity DataIC50: >1.00E+3nM. Assay description: The human D2L receptor binding activity of [3H]-spiperone was determined as follows. A solution containing 50 μL of [3H]-spiperone (the final co...
Ligand InfoPC cidPC sid
In DepthDetails US Patent