BDBM322148 US10183917, Example 9
SMILES OC(=O)c1ccc2CCc3cc(OCc4c(noc4C4CC4)-c4c(Cl)cccc4Cl)ccc3C3(CC3)c2c1
InChI Key InChIKey=REVJHAIOQXDYLU-UHFFFAOYSA-N
Data  1 EC50
  Tab Delimited (TSV)   2D SDfile   Computed 3D by Vconf -m prep SDfile
Find this compound or compounds like it in BindingDB:
Activity Spreadsheet -- Enzyme Inhibition Constant Data from BindingDB
Found 1 hit for monomerid = 322148
TargetBile acid receptor(Homo sapiens (Human))
Sunshine Lake Pharma
US Patent
LigandPNGBDBM322148(US10183917, Example 9)
Affinity DataEC50:  38nM. Assay description: Purchasing invitrogen PV4833 kits.First, the required amount of the compound was weighed and dissolved in 100% DMSO at the maximum concentration of 3...
Ligand InfoPC cidPC sid
In DepthDetails US Patent