BDBM322149 US10183917, Example 32
SMILES CS(=O)(=O)c1ccc2CCc3nc(OCc4c(noc4C4CC4)-c4c(Cl)cccc4Cl)ccc3Oc2c1
InChI Key InChIKey=BUKRPLDQZJIJQQ-UHFFFAOYSA-N
Data  1 EC50
  Tab Delimited (TSV)   2D SDfile   Computed 3D by Vconf -m prep SDfile
Find this compound or compounds like it in BindingDB:
Activity Spreadsheet -- Enzyme Inhibition Constant Data from BindingDB
Found 1 hit for monomerid = 322149
TargetBile acid receptor(Homo sapiens (Human))
Sunshine Lake Pharma
US Patent
LigandPNGBDBM322149(US10183917, Example 32)
Affinity DataEC50:  54nM. Assay description: Purchasing invitrogen PV4833 kits.First, the required amount of the compound was weighed and dissolved in 100% DMSO at the maximum concentration of 3...
Ligand InfoPC cidPC sid
In DepthDetails US Patent