BDBM322240 (S)-N-(2,2-dimethylquinuclidin-3-yl)pyrazolo[1,5-b]pyridazine-3-carboxamide::US10183938, Compound (S)-27
SMILES CC1(C)[C@@H](NC(=O)c2cnn3ncccc23)C2CCN1CC2
InChI Key InChIKey=GBEQPICPVWHHNJ-AWEZNQCLSA-N
Data  1 KI
  Tab Delimited (TSV)   2D SDfile   Computed 3D by Vconf -m prep SDfile
Find this compound or compounds like it in BindingDB:
Activity Spreadsheet -- Enzyme Inhibition Constant Data from BindingDB
Found 1 hit for monomerid = 322240
TargetNeuronal acetylcholine receptor subunit alpha-7(Homo sapiens (Human))
Axovant Sciences
US Patent
LigandPNGBDBM322240((S)-N-(2,2-dimethylquinuclidin-3-yl)pyrazolo[1,5-b...)
Affinity DataKi: >3.00E+4nM. Assay description: The ability of compounds to displace binding of radioactive ligands from human α7 nAChR was determined, as a measure of the affinity of the comp...
Ligand InfoPC cidPC sid
In DepthDetails US Patent