BDBM322511 (R)-N-(1'-azaspiro[cyclopropane-1,2'-bicyclo[2.2.2]octan]-3'-yl)benzo[d]isoxazole-3-carboxamide::US10183938, Compound (R)-267
SMILES O=C(N[C@@H]1C2CCN(CC2)C11CC1)c1noc2ccccc12
InChI Key InChIKey=VVSXKTKQYUMUDX-OAHLLOKOSA-N
Data  2 KI
  Tab Delimited (TSV)   2D SDfile   Computed 3D by Vconf -m prep SDfile
Find this compound or compounds like it in BindingDB:
Activity Spreadsheet -- Enzyme Inhibition Constant Data from BindingDB
Found 2 hits for monomerid = 322511
TargetNeuronal acetylcholine receptor subunit alpha-7(Homo sapiens (Human))
Axovant Sciences
US Patent
LigandPNGBDBM322511((R)-N-(1'-azaspiro[cyclopropane-1,2'-bicyclo[2.2.2...)
Affinity DataKi:  9.60E+3nM. Assay description: The ability of compounds to displace binding of radioactive ligands from human α7 nAChR was determined, as a measure of the affinity of the comp...
Ligand InfoPC cidPC sid
In DepthDetails US Patent
TargetNeuronal acetylcholine receptor subunit alpha-7(Homo sapiens (Human))
Axovant Sciences
US Patent
LigandPNGBDBM322511((R)-N-(1'-azaspiro[cyclopropane-1,2'-bicyclo[2.2.2...)
Affinity DataKi: >3.00E+4nM. Assay description: The ability of compounds to displace binding of radioactive ligands from human α7 nAChR was determined, as a measure of the affinity of the comp...
Ligand InfoPC cidPC sid
In DepthDetails US Patent