BDBM32269 3-(3-pyridinyl)-6-thiophen-2-yl-7H-[1,2,4]triazolo[3,4-b][1,3,4]thiadiazine::3-(3-pyridyl)-6-(2-thienyl)-7H-[1,2,4]triazolo[3,4-b][1,3,4]thiadiazine::3-pyridin-3-yl-6-thien-2-yl-7H-[1,2,4]triazolo[3,4-b][1,3,4]thiadiazine::3-pyridin-3-yl-6-thiophen-2-yl-7H-[1,2,4]triazolo[3,4-b][1,3,4]thiadiazine::MLS000094784::SMR000030337::cid_3242602
SMILES C1Sc2nnc(-c3cccnc3)n2N=C1c1cccs1
InChI Key InChIKey=JYNACUMZPKWVPV-UHFFFAOYSA-N
Data  1 IC50  1 EC50
  Tab Delimited (TSV)   2D SDfile   Computed 3D by Vconf -m prep SDfile
Find this compound or compounds like it in BindingDB:
Activity Spreadsheet -- Enzyme Inhibition Constant Data from BindingDB
Found 2 hits for monomerid = 32269
TargetComplement C1s subcomponent(Homo sapiens (Human))
Pcmd
Curated by PubChem BioAssay
LigandPNGBDBM32269(3-(3-pyridinyl)-6-thiophen-2-yl-7H-[1,2,4]triazolo...)
Affinity DataIC50: >5.00E+4nM. Assay description: Molecular Library Screening Center Network (MLSCN) Penn Center for Molecular Discovery (PCMD) Assay Provider: Dr. Scott L. Diamond, University of Pen...
In DepthDetails PCBioAssay
TargetIsoform Bcl-X(L) of Bcl-2-like protein 1 (Bcl-xL)(Homo sapiens (Human))
Nmmlsc
Curated by PubChem BioAssay
LigandPNGBDBM32269(3-(3-pyridinyl)-6-thiophen-2-yl-7H-[1,2,4]triazolo...)
Affinity DataEC50:  7.17E+3nMpH: 7.4 T: 2°C. Assay description: The HTS assay was conducted in 384-well microplates in a total assay volume per well of 10.1 microliters (5 microliters of bead mixture, 0.1 microlit...
In DepthDetails PCBioAssay