BDBM322868 2-(azepan-1-yl)-4-((6-(4-(2-hydroxy-2- methylpropanoyl)piperazin-1-yl)pyridin- 3-yl)amino)pyrimido[4,5-d]pyridazin- 5(6H)-one::US10183944, Example 238::US10647720, Ex. # 238
SMILES CC(C)(O)C(=O)N1CCN(CC1)c1ccc(Nc2nc(nc(C=N)c2C(N)=O)N2CCCCCC2)cn1
InChI Key InChIKey=OYPBTSFOPBMLJV-UHFFFAOYSA-N
Data  4 IC50
  Tab Delimited (TSV)   2D SDfile   Computed 3D by Vconf -m prep SDfile
Find this compound or compounds like it in BindingDB:
Activity Spreadsheet -- Enzyme Inhibition Constant Data from BindingDB
Found 4 hits for monomerid = 322868
TargetTyrosine-protein kinase SYK(Homo sapiens (Human))
Asana Biosciences
US Patent
LigandPNGBDBM322868(2-(azepan-1-yl)-4-((6-(4-(2-hydroxy-2- methylpropa...)
Affinity DataIC50: <50nM. Assay description: 2.5 μL of 10% DMSO or compound in 10% DMSO was added to the wells in a 96 well V-bottom plate. Optimized concentration of in-house Syk enzyme (d...
Ligand InfoPC cidPC sid
In DepthDetails US Patent
TargetTyrosine-protein kinase JAK2(Homo sapiens (Human))
Asan Biosciences
US Patent
LigandPNGBDBM322868(2-(azepan-1-yl)-4-((6-(4-(2-hydroxy-2- methylpropa...)
Affinity DataIC50: <10nM. Assay description: Two μL of 10% DMSO in blank, substrate control and positive control wells and 2 μL of test compound in test wells was added. Thirteen μ...
Ligand InfoPC cidPC sid
In DepthDetails US Patent
TargetTyrosine-protein kinase SYK(Homo sapiens (Human))
Asana Biosciences
US Patent
LigandPNGBDBM322868(2-(azepan-1-yl)-4-((6-(4-(2-hydroxy-2- methylpropa...)
Affinity DataIC50:  30nM. Assay description: 2.5 μL of 10% DMSO or compound in 10% DMSO was added to the wells in a 96 well V-bottom plate. Optimized concentration of in-house Syk enzyme (d...
Ligand InfoPC cidPC sid
In DepthDetails US Patent
TargetTyrosine-protein kinase JAK2(Homo sapiens (Human))
Asan Biosciences
US Patent
LigandPNGBDBM322868(2-(azepan-1-yl)-4-((6-(4-(2-hydroxy-2- methylpropa...)
Affinity DataIC50: <10nM. Assay description: Two μL of 10% DMSO in blank, substrate control and positive control wells and 2 μL of test compound in test wells was added. Thirteen μ...
Ligand InfoPC cidPC sid
In DepthDetails US Patent