BDBM323374 5-[5-amino-6-[3-[4-[(cyclopropylamino)methyl]phenyl]isoxazol-5-yl]pyrazin-2-yl]-1H-pyridin-2-one ::US9630956, Compound I-111
SMILES Nc1ncc(nc1-c1cc(no1)-c1ccc(CNC2CC2)cc1)-c1ccc(=O)[nH]c1
InChI Key InChIKey=BRISVTIGGKEIOR-UHFFFAOYSA-N
Data  1 KI
  Tab Delimited (TSV)   2D SDfile   Computed 3D by Vconf -m prep SDfile
Find this compound or compounds like it in BindingDB:
Activity Spreadsheet -- Enzyme Inhibition Constant Data from BindingDB
Found 1 hit for monomerid = 323374
TargetSerine/threonine-protein kinase ATR(Homo sapiens (Human))
Vertex Pharmaceuticals
US Patent
LigandPNGBDBM323374(5-[5-amino-6-[3-[4-[(cyclopropylamino)methyl]pheny...)
Affinity DataKi: <5nM. Assay description: Compounds were screened for their ability to inhibit ATR kinase using a radioactive-phosphate incorporation assay. Assays were carried out in a mixtu...
Ligand InfoPC cidPC sid
In DepthDetails US Patent