BDBM323615 (E)-6-(2-((4-(furan-2-yl)-N-methylbenzamido)methyl)-4-(trifluoromethyl) phenoxy)-4-methylhex-4-enoic acid ::US10188627, Compound 8aa
SMILES CN(Cc1cc(ccc1OC\C=C(/C)CCC(O)=O)C(F)(F)F)C(=O)c1ccc(cc1)-c1ccco1
InChI Key InChIKey=OLYOYMUWWQSQDR-QGOAFFKASA-N
Data  1 EC50
  Tab Delimited (TSV)   2D SDfile   Computed 3D by Vconf -m prep SDfile
Find this compound or compounds like it in BindingDB:
Activity Spreadsheet -- Enzyme Inhibition Constant Data from BindingDB
Found 1 hit for monomerid = 323615
TargetPeroxisome proliferator-activated receptor delta(Homo sapiens (Human))
Mitobridge
US Patent
LigandPNGBDBM323615((E)-6-(2-((4-(furan-2-yl)-N-methylbenzamido)methyl...)
Affinity DataEC50:  683nM. Assay description: Cell Handling: PathHunter NHR cell lines were expanded from freezer stocks according to standard procedures. Cells were seeded in a total volume of 2...
Ligand InfoPC cidPC sid
In DepthDetails US Patent