BDBM325033 9-(3-(cyclopropylmethoxy)benzyl)-2-(2-::US10189841, Compound I-239::US10399980, Compound I-239::US11161848, Compound I-239
SMILES CC(C)c1ccccc1-c1ncc2n(C)c(=O)n(Cc3cccc(OCC4CC4)c3)c2n1
InChI Key InChIKey=UJORFMCCUDZAJK-UHFFFAOYSA-N
Data  3 IC50
  Tab Delimited (TSV)   2D SDfile   Computed 3D by Vconf -m prep SDfile
Find this compound or compounds like it in BindingDB:
Activity Spreadsheet -- Enzyme Inhibition Constant Data from BindingDB
Found 3 hits for monomerid = 325033
TargetUbiquitin carboxyl-terminal hydrolase 1(Homo sapiens (Human))
Forma Therapeutics
US Patent
LigandPNGBDBM325033(9-(3-(cyclopropylmethoxy)benzyl)-2-(2- | US1018984...)
Affinity DataIC50: <0.00200nM. Assay description: The HTS assay was performed in a final volume of 20 μL in assay buffer containing 20 mM Tris-HCl (pH 8.0, (1M Tris-HCl, pH 8.0 solution; Corning...
Ligand InfoPC cidPC sid
In DepthDetails US Patent
TargetUbiquitin carboxyl-terminal hydrolase 1(Homo sapiens (Human))
Forma Therapeutics
US Patent
LigandPNGBDBM325033(9-(3-(cyclopropylmethoxy)benzyl)-2-(2- | US1018984...)
Affinity DataIC50: >2.00E+3nM. Assay description: The HTS assay was performed in a final volume of 20 μL in assay buffer containing 20 mM Tris-HCl (pH 8.0, (1M Tris-HCl, pH 8.0 solution; Corning...
Ligand InfoPC cidPC sid
In DepthDetails US Patent
TargetUbiquitin carboxyl-terminal hydrolase 1(Homo sapiens (Human))
Forma Therapeutics
US Patent
LigandPNGBDBM325033(9-(3-(cyclopropylmethoxy)benzyl)-2-(2- | US1018984...)
Affinity DataIC50: >2.00E+3nM. Assay description: The HTS assay was performed in a final volume of 20 μL in assay buffer containing 20 mM Tris-HCl (pH 8.0, (1M Tris-HCl, pH 8.0 solution; Corning...
Ligand InfoPC cidPC sid
In DepthDetails US Patent