BDBM32519 pyridine amide, 27
SMILES CC1(C)CCCN(C1)C(=O)c1cccc(n1)-c1ccccc1Cl
InChI Key InChIKey=ISCYAGGWPVUAIR-UHFFFAOYSA-N
Data  1 IC50
  Tab Delimited (TSV)   2D SDfile   Computed 3D by Vconf -m prep SDfile
Find this compound or compounds like it in BindingDB:
Activity Spreadsheet -- Enzyme Inhibition Constant Data from BindingDB
Found 1 hit for monomerid = 32519
Target11-beta-hydroxysteroid dehydrogenase 1 [23-292,A23S,F278E](Homo sapiens (Human))
Bristol-Myers Squibb
LigandPNGBDBM32519(pyridine amide, 27)
Affinity DataIC50:  2.90nMpH: 6.5 T: 2°C. Assay description: 11beta-HSD1 microsomes isolated from HEK 293 cells over-expressing human 11beta-HSD1 were incubated with the substrate cortisone and cofactor NADPH a...
In DepthDetails ArticlePubMed