BDBM32525 pyridine amide, 33
SMILES O=C(N1CCCC2CCCCC12)c1cccc(n1)-c1ccccc1-c1ccccc1
InChI Key InChIKey=WBENSGAXZXQOJM-UHFFFAOYSA-N
Data  1 IC50
  Tab Delimited (TSV)   2D SDfile   Computed 3D by Vconf -m prep SDfile
Find this compound or compounds like it in BindingDB:
Activity Spreadsheet -- Enzyme Inhibition Constant Data from BindingDB
Found 1 hit for monomerid = 32525
Target11-beta-hydroxysteroid dehydrogenase 1 [23-292,A23S,F278E](Homo sapiens (Human))
Bristol-Myers Squibb
LigandPNGBDBM32525(pyridine amide, 33)
Affinity DataIC50:  4.70nMpH: 6.5 T: 2°C. Assay description: 11beta-HSD1 microsomes isolated from HEK 293 cells over-expressing human 11beta-HSD1 were incubated with the substrate cortisone and cofactor NADPH a...
In DepthDetails ArticlePubMed