BDBM32547 arylsulfonylpiperazine, 19
SMILES FC(F)(F)c1cccnc1N1CCN(CC1)S(=O)(=O)c1cccc2ccccc12
InChI Key InChIKey=ZVOUEDZXAGJSST-UHFFFAOYSA-N
Data  3 IC50  1 EC50
  Tab Delimited (TSV)   2D SDfile   Computed 3D by Vconf -m prep SDfile
Find this compound or compounds like it in BindingDB:
Activity Spreadsheet -- Enzyme Inhibition Constant Data from BindingDB
Found 3 hits for monomerid = 32547
LigandPNGBDBM32547(arylsulfonylpiperazine, 19)
Affinity DataIC50:  13nM EC50:  329nMpH: 7.2 T: 2°C. Assay description: Enzyme assays were performed using purified recombinant human 11beta-HSD1. The fractional conversion of cortisone to cortisol was used to determine e...
In DepthDetails ArticlePubMed
Target11-beta-hydroxysteroid dehydrogenase 1(Homo sapiens (Human))
Shanghai Pharmaceutical Holding
Curated by ChEMBL
LigandPNGBDBM32547(arylsulfonylpiperazine, 19)
Affinity DataIC50:  13nM. Assay description: Inhibition of human 11beta HSD1 expressed in HEK293 cells assessed as assessed as inhibition of [1,2-(n)3H]cortisone to [3H]-cortisol after 60 mins b...
In DepthDetails ArticlePubMed
Target11-beta-hydroxysteroid dehydrogenase 1(Mus musculus (mouse))
Amgen
LigandPNGBDBM32547(arylsulfonylpiperazine, 19)
Affinity DataIC50:  80nM. Assay description: Enzyme assays were performed using purified recombinant mouse11beta-HSD1. The fractional conversion of cortisone to cortisol was used to determine en...
In DepthDetails ArticlePubMed