BDBM325785 (3-(4-(2-((2,6-difluorobenzyl)oxy)-1,1,1,3,3,3-hexafluoropropan-2-yl)phenyl)-3-((4-fluorophenyl)sulfonyl)piperidin-1-yl)(4-hydroxy-4-(trifluoromethyl)piperidin-1-yl)methanone::US9637455, 2
SMILES Fc1ccc(cc1)S(=O)(=O)C(=C)c1ccc(cc1)C(OCc1c(F)cccc1F)(C(F)(F)F)C(F)(F)F
InChI Key InChIKey=XUJVCVLNDXVLPH-UHFFFAOYSA-N
Data  1 IC50
  Tab Delimited (TSV)   2D SDfile   Computed 3D by Vconf -m prep SDfile
Find this compound or compounds like it in BindingDB:
Activity Spreadsheet -- Enzyme Inhibition Constant Data from BindingDB
Found 1 hit for monomerid = 325785
TargetNuclear receptor ROR-gamma [262-507](Homo sapiens (Human))
Bristol-Myers Squibb
US Patent
LigandPNGBDBM325785((3-(4-(2-((2,6-difluorobenzyl)oxy)-1,1,1,3,3,3-hex...)
Affinity DataIC50:  2.63E+3nM. Assay description: The binding of potential ligands to RORγ is measured by competition with [3H]25-hydroxycholesterol (Perkin Elmer NET674250UC) using a scintillat...
Ligand InfoPC cidPC sid
In DepthDetails US Patent