BDBM326355 (1R*,2S*)-2-(3-Aminopropyl)-1-[1-(2-chlorophenyl)-1H-imidazol-4-yl]cyclopropanecarboxylic acid hydrochloride::US9662310, Example 20
SMILES CCOC(=O)C1(CC1CCCN(C(=O)OC(C)(C)C)C(=O)OC(C)(C)C)c1cn(cn1)-c1ccccc1Cl
InChI Key InChIKey=DJUGKLDQGDPBHX-UHFFFAOYSA-N
Data  1 IC50
  Tab Delimited (TSV)   2D SDfile   Computed 3D by Vconf -m prep SDfile
Find this compound or compounds like it in BindingDB:
Activity Spreadsheet -- Enzyme Inhibition Constant Data from BindingDB
Found 1 hit for monomerid = 326355
TargetCarboxypeptidase B2(Homo sapiens (Human))
Daiichi Sankyo
US Patent
LigandPNGBDBM326355((1R*,2S*)-2-(3-Aminopropyl)-1-[1-(2-chlorophenyl)-...)
Affinity DataIC50:  140nM. Assay description: HEPES buffered saline (20 mM HEPES, 150 mM NaCl, pH 7.4; hereinafter, referred to as HBS) was used in the preparation of a reaction solution. To 12 &...
Ligand InfoPC cidPC sid
In DepthDetails US Patent