BDBM326368 (1R*,2S*)-2-(3-Amino-2-methylpropyl)-1-[1-(4-methylphenyl)-1H-imidazol-4-yl]cyclopropanecarboxylic acid::US9662310, Example 33
SMILES COC(=O)C1(CC1CC(C)CN(C(=O)OC(C)(C)C)C(=O)OC(C)(C)C)c1cn(cn1)-c1ccc(C)cc1
InChI Key InChIKey=WUABPXZRIPMTOY-UHFFFAOYSA-N
Data  1 IC50
  Tab Delimited (TSV)   2D SDfile   Computed 3D by Vconf -m prep SDfile
Find this compound or compounds like it in BindingDB:
Activity Spreadsheet -- Enzyme Inhibition Constant Data from BindingDB
Found 1 hit for monomerid = 326368
TargetCarboxypeptidase B2(Homo sapiens (Human))
Daiichi Sankyo
US Patent
LigandPNGBDBM326368((1R*,2S*)-2-(3-Amino-2-methylpropyl)-1-[1-(4-methy...)
Affinity DataIC50:  39nM. Assay description: HEPES buffered saline (20 mM HEPES, 150 mM NaCl, pH 7.4; hereinafter, referred to as HBS) was used in the preparation of a reaction solution. To 12 &...
Ligand InfoPC cidPC sid
In DepthDetails US Patent