BDBM326830 US9662327, Compound 415
SMILES CC(C)[C@@H]1CN(CCN1C(=O)Cn1cc(Br)cn1)c1nc(C2CC2)c2COC(C)(C)Cc2c1C#N
InChI Key InChIKey=VFXPDTRAAHRVJQ-QFIPXVFZSA-N
Data  1 IC50
  Tab Delimited (TSV)   2D SDfile   Computed 3D by Vconf -m prep SDfile
Find this compound or compounds like it in BindingDB:
Activity Spreadsheet -- Enzyme Inhibition Constant Data from BindingDB
Found 1 hit for monomerid = 326830
TargetIsocitrate dehydrogenase [NADP] cytoplasmic [R132H](Homo sapiens (Human))
Agios Pharmaceuticals
US Patent
LigandPNGBDBM326830(US9662327, Compound 415)
Affinity DataIC50:  750nM. Assay description: Assays were conducted in a volume of 76 μl assay buffer (150 mM NaCl, 10 mM MgCl2, 20 mM Tris pH 7.5, 0.03% bovine serum albumin) as follows in ...
Ligand InfoPC cidPC sid
In DepthDetails US Patent