BDBM327842 2-((R)-2-methyl-4-((R)-phenyl(4-(2-phenylethynyl)phenyl)methyl)piperazin-1-yl)acetic acid::US9663476, Compound 55A
SMILES C[C@@H]1CN(CCN1CC(O)=O)[C@H](c1ccccc1)c1ccc(cc1)C#Cc1ccccc1
InChI Key InChIKey=IUPFIUUFWNDGBI-SKCUWOTOSA-N
Data  1 IC50
  Tab Delimited (TSV)   2D SDfile   Computed 3D by Vconf -m prep SDfile
Find this compound or compounds like it in BindingDB:
Activity Spreadsheet -- Enzyme Inhibition Constant Data from BindingDB
Found 1 hit for monomerid = 327842
TargetSodium- and chloride-dependent glycine transporter 1(Homo sapiens (Human))
Amgen
US Patent
LigandPNGBDBM327842(2-((R)-2-methyl-4-((R)-phenyl(4-(2-phenylethynyl)p...)
Affinity DataIC50:  2.70nM. Assay description: This cell-based assay measures the ability of test compounds to inhibit the uptake of glycine by the glycine transporter type 1. Human placental chor...
Ligand InfoPC cidPC sid
In DepthDetails US Patent