BDBM327884 N-(1-(4-cyanobenzyl)- 1H-pyrazol-4-yl)-5-(4- (4- fluorobenzyl)piperazine- 1-carbonyl)picolinamide::US10377742, Compound 23::US9663496, Compound 23
SMILES Fc1ccc(CN2CCN(CC2)C(=O)c2ccc(nc2)C(=O)Nc2cnn(Cc3ccc(cc3)C#N)c2)cc1
InChI Key InChIKey=NFOUIFJMANKDPS-UHFFFAOYSA-N
Data  2 EC50
  Tab Delimited (TSV)   2D SDfile   Computed 3D by Vconf -m prep SDfile
Find this compound or compounds like it in BindingDB:
Activity Spreadsheet -- Enzyme Inhibition Constant Data from BindingDB
Found 2 hits for monomerid = 327884
Target5'-AMP-activated protein kinase catalytic subunit alpha-2(Homo sapiens (Human))
Rigel Pharmaceuticals
US Patent
LigandPNGBDBM327884(N-(1-(4-cyanobenzyl)- 1H-pyrazol-4-yl)-5-(4- (4- f...)
Affinity DataEC50: <500nM. Assay description: Compounds were assayed for their ability to activate AMPK using an enzyme-linked immunosorbent assay. Reagents and procedures for measuring AMPK acti...
Ligand InfoPC cidPC sid
In DepthDetails US Patent
Target5'-AMP-activated protein kinase catalytic subunit alpha-2(Homo sapiens (Human))
Rigel Pharmaceuticals
US Patent
LigandPNGBDBM327884(N-(1-(4-cyanobenzyl)- 1H-pyrazol-4-yl)-5-(4- (4- f...)
Affinity DataEC50: <500nM. Assay description: Compounds were assayed for their ability to activate AMPK using an enzyme-linked immunosorbent assay. Reagents and procedures for measuring AMPK acti...
Ligand InfoPC cidPC sid
In DepthDetails US Patent