BDBM32867 MLS000680761::N-(3-ethylphenyl)-2-(4-nitrophenyl)acetamide::N-(3-ethylphenyl)-2-(4-nitrophenyl)ethanamide::SMR000272477::cid_887149
SMILES CCc1cccc(NC(=O)Cc2ccc(cc2)[N+]([O-])=O)c1
InChI Key InChIKey=BSCVPHMFPNAWOK-UHFFFAOYSA-N
Data  2 IC50
  Tab Delimited (TSV)   2D SDfile   Computed 3D by Vconf -m prep SDfile
Find this compound or compounds like it in BindingDB:
Activity Spreadsheet -- Enzyme Inhibition Constant Data from BindingDB
Found 2 hits for monomerid = 32867
TargetKallikrein-5(Homo sapiens (Human))
Pcmd
Curated by PubChem BioAssay
LigandPNGBDBM32867(MLS000680761 | N-(3-ethylphenyl)-2-(4-nitrophenyl)...)
Affinity DataIC50:  5.00E+4nM. Assay description: Molecular Library Screening Center Network (MLSCN) Penn Center for Molecular Discovery (PCMD) Assay Provider: Scott L. Diamond, University of Pennsy...
In DepthDetails PCBioAssay
TargetCoagulation factor XI(Homo sapiens (Human))
Pcmd
Curated by PubChem BioAssay
LigandPNGBDBM32867(MLS000680761 | N-(3-ethylphenyl)-2-(4-nitrophenyl)...)
Affinity DataIC50: >5.00E+4nMpH: 7.4 T: 2°C. Assay description: Factor XIa (0.23 ug/mL) was incubated with Boc-Glu-Ala-Arg-AMC substrate (15 uM) in 10 uL of assay buffer for 2 hr at room temperature. Read fluoresc...
In DepthDetails PCBioAssay