BDBM3302 4-Anilinoquinazoline deriv. 53::4-[(3-bromophenyl)amino]quinazoline-6,7-diol::44 (3-Bromophenyl)amino]-6,7-dihydroxyquinazoline::CHEMBL93032
SMILES Oc1cc2ncnc(Nc3cccc(Br)c3)c2cc1O
InChI Key InChIKey=CZMCXMIIVHUIPE-UHFFFAOYSA-N
Data  3 IC50
  Tab Delimited (TSV)   2D SDfile   Computed 3D by Vconf -m prep SDfile
Find this compound or compounds like it in BindingDB:
Activity Spreadsheet -- Enzyme Inhibition Constant Data from BindingDB
Found 3 hits for monomerid = 3302
TargetEpidermal growth factor receptor(Homo sapiens (Human))
Parke-Davis Pharmaceutical Research
LigandPNGBDBM3302(4-Anilinoquinazoline deriv. 53 | 4-[(3-bromophenyl...)
Affinity DataIC50:  0.170nM. Assay description: IC50 is the inhibitor concentration which inhibits 50% of kinase activity that catalyzes the transfer of the terminal phosphate from [gamma-32P] labe...
In DepthDetails ArticlePubMed
TargetEpidermal growth factor receptor(Homo sapiens (Human))
Parke-Davis Pharmaceutical Research
LigandPNGBDBM3302(4-Anilinoquinazoline deriv. 53 | 4-[(3-bromophenyl...)
Affinity DataIC50:  0.174nM. Assay description: Inhibition of EGFR
In DepthDetails ArticlePubMed
TargetEpidermal growth factor receptor(Homo sapiens (Human))
Parke-Davis Pharmaceutical Research
LigandPNGBDBM3302(4-Anilinoquinazoline deriv. 53 | 4-[(3-bromophenyl...)
Affinity DataIC50:  0.170nM. Assay description: IC50 is the inhibitor concentration which inhibits 50% of kinase activity that catalyzes the transfer of the terminal phosphate from [gamma-32P] labe...
In DepthDetails ArticlePubMed