BDBM33042 MLS000040389::N,N-diethyl-4-[3-(2-methoxyphenyl)-[1,2,4]triazolo[3,4-b][1,3,4]thiadiazol-6-yl]aniline::SMR000043003::cid_662393::diethyl-[4-[3-(2-methoxyphenyl)-[1,2,4]triazolo[3,4-b][1,3,4]thiadiazol-6-yl]phenyl]amine
SMILES CCN(CC)c1ccc(cc1)-c1nn2c(nnc2s1)-c1ccccc1OC
InChI Key InChIKey=GVUJCIMICCVZOK-UHFFFAOYSA-N
Data  2 IC50  4 EC50
  Tab Delimited (TSV)   2D SDfile   Computed 3D by Vconf -m prep SDfile
Find this compound or compounds like it in BindingDB:
Activity Spreadsheet -- Enzyme Inhibition Constant Data from BindingDB
Found 6 hits for monomerid = 33042
TargetBcl-2-related protein A1(Homo sapiens (Human))
Nmmlsc
Curated by PubChem BioAssay
LigandPNGBDBM33042(MLS000040389 | N,N-diethyl-4-[3-(2-methoxyphenyl)-...)
Affinity DataEC50:  4.08E+4nMpH: 7.4 T: 2°C. Assay description: The multiplex is constructed by using beads for each protein target that have been labeled with varying intensities of red color, so that each assay ...
In DepthDetails PCBioAssay
TargetIsoform 2 of Nuclear receptor ROR-alpha (Alpha-2)(Homo sapiens (Human))
The Scripps Research Institute Molecular Screening Center
Curated by PubChem BioAssay
LigandPNGBDBM33042(MLS000040389 | N,N-diethyl-4-[3-(2-methoxyphenyl)-...)
Affinity DataIC50: >3.67E+3nM. Assay description: Source (MLSCN Center Name): The Scripps Research Institute Molecular Screening Center Center Affiliation: The Scripps Research Institute, TSRI Assay ...
In DepthDetails PCBioAssay
TargetStreptokinase A(Streptococcus pyogenes M1 GAS)
Broad Institute
Curated by PubChem BioAssay
LigandPNGBDBM33042(MLS000040389 | N,N-diethyl-4-[3-(2-methoxyphenyl)-...)
Affinity DataEC50:  1.50E+5nM. Assay description: Keywords: Group A streptococcus, GAS, streptokinase, expression, virulence, inhibition, dose response, EC50 Assay Overview: The goal of this assa...
In DepthDetails PCBioAssay
TargetSteroidogenic factor 1(Homo sapiens (Human))
The Scripps Research Institute Molecular Screening Center
Curated by PubChem BioAssay
LigandPNGBDBM33042(MLS000040389 | N,N-diethyl-4-[3-(2-methoxyphenyl)-...)
Affinity DataIC50:  5.03E+3nM. Assay description: Source (MLSCN Center Name): The Scripps Research Institute Molecular Screening Center Center Affiliation: The Scripps Research Institute, TSRI Assay ...
In DepthDetails PCBioAssay
TargetBcl-2-like protein 10 [11-204](Homo sapiens (Human))
Nmmlsc
Curated by PubChem BioAssay
LigandPNGBDBM33042(MLS000040389 | N,N-diethyl-4-[3-(2-methoxyphenyl)-...)
Affinity DataEC50:  2.17E+4nM. Assay description: University of New Mexico Assay Overview: Assay Support: NIH 1X01 MH079850-01 HTS to identify small molecule regulators of Bcl-2 family protein int...
In DepthDetails PCBioAssay
TargetEstrogen receptor(Homo sapiens (Human))
Emory University
Curated by PubChem BioAssay
LigandPNGBDBM33042(MLS000040389 | N,N-diethyl-4-[3-(2-methoxyphenyl)-...)
Affinity DataEC50:  1.82E+4nM. Assay description: NIH Molecular Libraries Screening Centers Network [MLSCN] Emory Chemical Biology Discovery Center in MLSCN Assay provider: John A. Katzenellenbogen, ...
In DepthDetails PCBioAssay