BDBM33126 MLS000392298::N-[3-[(1,1-diketothiolan-3-yl)amino]-1,4-diketo-2-naphthyl]acetamide::N-[3-[(1,1-dioxo-3-thiolanyl)amino]-1,4-dioxo-2-naphthalenyl]acetamide::N-[3-[(1,1-dioxothiolan-3-yl)amino]-1,4-dioxonaphthalen-2-yl]acetamide::N-[3-[[1,1-bis(oxidanylidene)thiolan-3-yl]amino]-1,4-bis(oxidanylidene)naphthalen-2-yl]ethanamide::SMR000261267::cid_3661963
SMILES CC(=O)NC1=C(NC2CCS(=O)(=O)C2)C(=O)c2ccccc2C1=O
InChI Key InChIKey=ZPKLGZLJWFSQNN-UHFFFAOYSA-N
Data  1 IC50  2 EC50
  Tab Delimited (TSV)   2D SDfile   Computed 3D by Vconf -m prep SDfile
Find this compound or compounds like it in BindingDB:
Activity Spreadsheet -- Enzyme Inhibition Constant Data from BindingDB
Found 3 hits for monomerid = 33126
TargetBcl-2-related protein A1(Homo sapiens (Human))
Nmmlsc
Curated by PubChem BioAssay
LigandPNGBDBM33126(MLS000392298 | N-[3-[(1,1-diketothiolan-3-yl)amino...)
Affinity DataEC50:  1.55E+3nMpH: 7.4 T: 2°C. Assay description: The multiplex is constructed by using beads for each protein target that have been labeled with varying intensities of red color, so that each assay ...
In DepthDetails PCBioAssay
TargetInduced myeloid leukemia cell differentiation protein Mcl-1(Homo sapiens (Human))
Emory University
Curated by PubChem BioAssay
LigandPNGBDBM33126(MLS000392298 | N-[3-[(1,1-diketothiolan-3-yl)amino...)
Affinity DataIC50:  2.54E+3nM. Assay description: NIH Molecular Libraries Screening Centers Network [MLSCN] Emory Chemical Biology Discovery Center in MLSCN Assay provider: Nikolovska-Coleska, Univer...
In DepthDetails PCBioAssay
TargetBcl-2-like protein 2(Homo sapiens (Human))
Nmmlsc
Curated by PubChem BioAssay
LigandPNGBDBM33126(MLS000392298 | N-[3-[(1,1-diketothiolan-3-yl)amino...)
Affinity DataEC50:  3.49E+3nM. Assay description: University of New Mexico Assay Overview: Assay Support: NIH 1X01 MH079850-01 HTS to identify small molecule regulators of Bcl-2 family protein int...
In DepthDetails PCBioAssay