BDBM33164 4-[(2-ethoxybenzyl)amino]phenol::4-[(2-ethoxyphenyl)methylamino]phenol::MLS000693814::SMR000299878::cid_833983
SMILES CCOc1ccccc1CNc1ccc(O)cc1
InChI Key InChIKey=QRHODCFUINANGJ-UHFFFAOYSA-N
Data  6 IC50  4 EC50
  Tab Delimited (TSV)   2D SDfile   Computed 3D by Vconf -m prep SDfile
Find this compound or compounds like it in BindingDB:
Activity Spreadsheet -- Enzyme Inhibition Constant Data from BindingDB
Found 10 hits for monomerid = 33164
TargetBcl-2-related protein A1(Homo sapiens (Human))
Nmmlsc
Curated by PubChem BioAssay
LigandPNGBDBM33164(4-[(2-ethoxybenzyl)amino]phenol | 4-[(2-ethoxyphen...)
Affinity DataEC50:  1.13E+3nMpH: 7.4 T: 2°C. Assay description: The multiplex is constructed by using beads for each protein target that have been labeled with varying intensities of red color, so that each assay ...
In DepthDetails PCBioAssay
TargetBcl-2-like protein 2(Homo sapiens (Human))
Nmmlsc
Curated by PubChem BioAssay
LigandPNGBDBM33164(4-[(2-ethoxybenzyl)amino]phenol | 4-[(2-ethoxyphen...)
Affinity DataEC50:  2.31E+3nM. Assay description: University of New Mexico Assay Overview: Assay Support: NIH 1X01 MH079850-01 HTS to identify small molecule regulators of Bcl-2 family protein int...
In DepthDetails PCBioAssay
TargetApoptosis regulator Bcl-2(Homo sapiens (Human))
Nmmlsc
Curated by PubChem BioAssay
LigandPNGBDBM33164(4-[(2-ethoxybenzyl)amino]phenol | 4-[(2-ethoxyphen...)
Affinity DataEC50:  3.63E+3nM. Assay description: University of New Mexico Assay Overview: Assay Support: NIH 1X01 MH079850-01 HTS to identify small molecule regulators of Bcl-2 family protein int...
In DepthDetails PCBioAssay
TargetBcl-2-like protein 2(Homo sapiens (Human))
Nmmlsc
Curated by PubChem BioAssay
LigandPNGBDBM33164(4-[(2-ethoxybenzyl)amino]phenol | 4-[(2-ethoxyphen...)
Affinity DataEC50:  2.60E+4nM. Assay description: University of New Mexico Assay Overview: Assay Support: NIH 1X01 MH079850-01 HTS to identify small molecule regulators of Bcl-2 family protein int...
In DepthDetails PCBioAssay
TargetGlucose-6-phosphate dehydrogenase-6-phosphogluconolactonase(Plasmodium falciparum 3D7)
Burnham Center For Chemical Genomics
Curated by PubChem BioAssay
LigandPNGBDBM33164(4-[(2-ethoxybenzyl)amino]phenol | 4-[(2-ethoxyphen...)
Affinity DataIC50:  4.67E+4nM. Assay description: Data Source: Sanford-Burnham Center for Chemical Genomics (SBCCG) Source Affiliation: Sanford-Burnham Medical Research Institute (SBMRI, San Diego CA...
In DepthDetails PCBioAssay
TargetPlectin(Homo sapiens (Human))
Burnham Center For Chemical Genomics
Curated by PubChem BioAssay
LigandPNGBDBM33164(4-[(2-ethoxybenzyl)amino]phenol | 4-[(2-ethoxyphen...)
Affinity DataIC50:  5.62E+4nM. Assay description: Data Source: Sanford-Burnham Center for Chemical Genomics (SBCCG) Source Affiliation: Sanford-Burnham Medical Research Institute (SBMRI, San Diego, C...
In DepthDetails PCBioAssay
TargetGlucose-6-phosphate 1-dehydrogenase(Homo sapiens (Human))
Burnham Center For Chemical Genomics
Curated by PubChem BioAssay
LigandPNGBDBM33164(4-[(2-ethoxybenzyl)amino]phenol | 4-[(2-ethoxyphen...)
Affinity DataIC50: >8.00E+4nM. Assay description: Data Source: Sanford-Burnham Center for Chemical Genomics (SBCCG) Source Affiliation: Sanford-Burnham Medical Research Institute (SBMRI, San Diego CA...
In DepthDetails PCBioAssay
TargetGlucose-6-phosphate dehydrogenase-6-phosphogluconolactonase(Plasmodium falciparum 3D7)
Burnham Center For Chemical Genomics
Curated by PubChem BioAssay
LigandPNGBDBM33164(4-[(2-ethoxybenzyl)amino]phenol | 4-[(2-ethoxyphen...)
Affinity DataIC50:  1.92E+4nM. Assay description: Data Source: Sanford-Burnham Center for Chemical Genomics (SBCCG) Source Affiliation: Sanford-Burnham Medical Research Institute (SBMRI, San Diego CA...
In DepthDetails PCBioAssay
TargetGlucose-6-phosphate dehydrogenase-6-phosphogluconolactonase(Plasmodium falciparum 3D7)
Burnham Center For Chemical Genomics
Curated by PubChem BioAssay
LigandPNGBDBM33164(4-[(2-ethoxybenzyl)amino]phenol | 4-[(2-ethoxyphen...)
Affinity DataIC50: >8.00E+4nM. Assay description: Data Source: Sanford-Burnham Center for Chemical Genomics (SBCCG) Source Affiliation: Sanford-Burnham Medical Research Institute (SBMRI, San Diego CA...
In DepthDetails PCBioAssay
TargetPlectin(Homo sapiens (Human))
Burnham Center For Chemical Genomics
Curated by PubChem BioAssay
LigandPNGBDBM33164(4-[(2-ethoxybenzyl)amino]phenol | 4-[(2-ethoxyphen...)
Affinity DataIC50:  5.11E+3nM. Assay description: Data Source: Sanford-Burnham Center for Chemical Genomics (SBCCG) Source Affiliation: Sanford-Burnham Medical Research Institute (SBMRI, San Diego, C...
In DepthDetails PCBioAssay