BDBM33210 4-(7H-purin-6-yl)morpholine::purine, 9
SMILES C1CN(CCO1)c1ncnc2nc[nH]c12
InChI Key InChIKey=MEOMXKNIFWDDGZ-UHFFFAOYSA-N
Data  4 IC50  1 Other
PDB links: 1 PDB ID matches this monomer.
  Tab Delimited (TSV)   2D SDfile   Computed 3D by Vconf -m prep SDfile
Find this compound or compounds like it in BindingDB:
Activity Spreadsheet -- Enzyme Inhibition Constant Data from BindingDB
Found 5 hits for monomerid = 33210
TargetSerine/threonine-protein kinase Chk1(Homo sapiens (Human))
The Institute Of Cancer Research
LigandPNGBDBM33210(4-(7H-purin-6-yl)morpholine | purine, 9)
Affinity DatapH: 7.5 T: 2°C. Assay description: AlphaScreen (PerkinElmer Life Sciences, Inc) was performed in opaque 384-well polypropylene plates. The assay relies on hydrogel coated Donor and Acc...
TargetSerine/threonine-protein kinase Chk1(Homo sapiens (Human))
The Institute Of Cancer Research
LigandPNGBDBM33210(4-(7H-purin-6-yl)morpholine | purine, 9)
Affinity DataIC50:  4.20E+4nMpH: 7.5 T: 2°C. Assay description: CHK kinase function was measured in a DELFIA assay in order to monitor phosphorylation of a CDC25C peptide using a specific phospho antibody. The enz...
Target3-phosphoinositide-dependent protein kinase 1(Homo sapiens (Human))
S*Bio
Curated by ChEMBL
LigandPNGBDBM33210(4-(7H-purin-6-yl)morpholine | purine, 9)
Affinity DataIC50:  9.20E+4nM. Assay description: Competitive inhibition of PDK1 using [gamma-33P]-ATP as substrate after 30 mins by scintillation counting
In DepthDetails ArticlePubMed
TargetSerine/threonine-protein kinase PAK 1(Homo sapiens (Human))
Vertex Pharmaceuticals
Curated by ChEMBL
LigandPNGBDBM33210(4-(7H-purin-6-yl)morpholine | purine, 9)
Affinity DataIC50:  1.80E+4nM. Assay description: Inhibition of PAK1
In DepthDetails ArticlePubMed
TargetRho-associated protein kinase 2(Homo sapiens (Human))
The Scripps Research Institute Molecular Screening Center
Curated by PubChem BioAssay
LigandPNGBDBM33210(4-(7H-purin-6-yl)morpholine | purine, 9)
Affinity DataIC50:  7.09E+3nM. Assay description: Source (MLSCN Center Name): The Scripps Research Institute Molecular Screening Center Center Affiliation: The Scripps Research Institute, TSRI Assay ...
In DepthDetails PCBioAssay