BDBM33218 Adenine, 1::CHEMBL226345::purine, 6
SMILES Nc1ncnc2nc[nH]c12
InChI Key InChIKey=GFFGJBXGBJISGV-UHFFFAOYSA-N
Data  4 IC50
PDB links: 44 PDB IDs match this monomer.
  Tab Delimited (TSV)   2D SDfile   Computed 3D by Vconf -m prep SDfile
Find this compound or compounds like it in BindingDB:
Activity Spreadsheet -- Enzyme Inhibition Constant Data from BindingDB
Found 4 hits for monomerid = 33218
TargetHeat shock protein HSP 90-beta(Homo sapiens (Human))
Vernalis (R&D)
LigandPNGBDBM33218(Adenine, 1 | CHEMBL226345 | purine, 6)
Affinity DataIC50: >4.00E+6nMpH: 7.4 T: 2°C. Assay description: The assay is based upon displacement of a fluorescently labeled molecule, which binds specifically to the ATP-binding site of full-length human Hsp90...
In DepthDetails ArticlePubMed
TargetXanthine dehydrogenase/oxidase(Homo sapiens (Human))
Institute Of Biological Chemistry And The Genomics Research Center
Curated by ChEMBL
LigandPNGBDBM33218(Adenine, 1 | CHEMBL226345 | purine, 6)
Affinity DataIC50:  1.09E+4nM. Assay description: Inhibition of human xanthine oxidase
In DepthDetails ArticlePubMed
TargetCyclin-dependent kinase 1(Homo sapiens (Human))
Charles University
Curated by ChEMBL
LigandPNGBDBM33218(Adenine, 1 | CHEMBL226345 | purine, 6)
Affinity DataIC50:  2.00E+5nM. Assay description: Inhibitory activity against purified cdc2 p34/Cyclin B obtained from M phase oocytes of the starfish Marthasterias glacialis.
In DepthDetails ArticlePubMed
TargetXanthine dehydrogenase/oxidase(Homo sapiens (Human))
Institute Of Biological Chemistry And The Genomics Research Center
Curated by ChEMBL
LigandPNGBDBM33218(Adenine, 1 | CHEMBL226345 | purine, 6)
Affinity DataIC50:  7.56E+4nM. Assay description: Inhibition assay of the xanthine oxidase reaction by various purine based inhibitors was measured in terms of the decrease in uric acid formation at ...
In DepthDetails ArticlePubMed