BDBM332496 4-(1-{[2-chloro-6- (trifluoromethyl) phenyl]carbonyl}-6- pyridin-4-yl-1H-indazol- 3-yl)benzoic acid::US10196354, Example 23B::US9745265, 23B
SMILES OC(=O)c1ccc(cc1)-c1nn(C(=O)c2c(Cl)cccc2C(F)(F)F)c2cc(ccc12)-c1ccncc1
InChI Key InChIKey=UUUDMJKDJAOEQW-UHFFFAOYSA-N
Data  2 IC50
  Tab Delimited (TSV)   2D SDfile   Computed 3D by Vconf -m prep SDfile
Find this compound or compounds like it in BindingDB:
Activity Spreadsheet -- Enzyme Inhibition Constant Data from BindingDB
Found 2 hits for monomerid = 332496
TargetNuclear receptor ROR-gamma(Mus musculus)
Merck Sharp & Dohme
US Patent
LigandPNGBDBM332496(4-(1-{[2-chloro-6- (trifluoromethyl) phenyl]carbon...)
Affinity DataIC50: >1.00E+4nM. Assay description: To identify novel antagonists of RORgammaT, an assay was developed which employs the interaction of RORgammaT with its co-activator peptide SRC1_2. T...
Ligand InfoPC cidPC sid
In DepthDetails US Patent
TargetNuclear receptor ROR-gamma(Homo sapiens (Human))
Merck Sharp & Dohme
US Patent
LigandPNGBDBM332496(4-(1-{[2-chloro-6- (trifluoromethyl) phenyl]carbon...)
Affinity DataIC50: >1.00E+4nM. Assay description: The compounds of the invention inhibit RORgammaT activity. Activation of RORgammaT activity can be measured using, e.g., biochemical TR-FRET assay. I...
Ligand InfoPC cidPC sid
In DepthDetails US Patent