BDBM333391 (−)-2-{[3-(1-Benzofuran-2-yl)imidazo[1,2-b]pyridazin-6-yl](methyl)amino}-1-phenylethanol::US9730929, Example 12
SMILES CN(CC(O)c1ccccc1)c1ccc2ncc(-c3cc4ccccc4o3)n2n1
InChI Key InChIKey=DOULTRRSRHMYRE-UHFFFAOYSA-N
Data  1 IC50
  Tab Delimited (TSV)   2D SDfile   Computed 3D by Vconf -m prep SDfile
Find this compound or compounds like it in BindingDB:
Activity Spreadsheet -- Enzyme Inhibition Constant Data from BindingDB
Found 1 hit for monomerid = 333391
TargetMAP kinase-interacting serine/threonine-protein kinase 1(Homo sapiens (Human))
Bayer Intellectual Property
US Patent
LigandPNGBDBM333391((−)-2-{[3-(1-Benzofuran-2-yl)imidazo[1,2-b]p...)
Affinity DataIC50:  4nM. Assay description: A recombinant fusion protein of Glutathione-S-Transferase (GST, N-terminally) and human full-length MKNK1 (amino acids 1-424 and T344D of accession n...
Ligand InfoPC cidPC sid
In DepthDetails US Patent