BDBM333607 1-(3-(6,7- dimethoxy- quinazolin- 4- ylthio)phenyl)-3- (3-(1- (trifluoromethyl) cyclobutyl) isoxazol- 5-yl)urea::US9730937, Example 156
SMILES COc1cc2ncnc(Sc3cccc(NC(=O)Nc4cc(no4)C4(CCC4)C(F)(F)F)c3)c2cc1OC
InChI Key InChIKey=FDLXXXYPEZEBEK-UHFFFAOYSA-N
Data  3 Kd
  Tab Delimited (TSV)   2D SDfile   Computed 3D by Vconf -m prep SDfile
Find this compound or compounds like it in BindingDB:
Activity Spreadsheet -- Enzyme Inhibition Constant Data from BindingDB
Found 3 hits for monomerid = 333607
TargetSerine/threonine-protein kinase B-raf [V600E](Homo sapiens (Human))
Ambit Biosciences
US Patent
LigandPNGBDBM333607(1-(3-(6,7- dimethoxy- quinazolin- 4- ylthio)phenyl...)
Affinity DataKd:  750nM. Assay description: Competition binding assays used herein were developed, validated and performed as described in Fabian et al., Nature Biotechnology 2005, 23, 329-336....
Ligand InfoPC cidPC sid
In DepthDetails US Patent
TargetRAF proto-oncogene serine/threonine-protein kinase(Homo sapiens (Human))
Ambit Biosciences
US Patent
LigandPNGBDBM333607(1-(3-(6,7- dimethoxy- quinazolin- 4- ylthio)phenyl...)
Affinity DataKd: >1.00E+3nM. Assay description: Competition binding assays used herein were developed, validated and performed as described in Fabian et al., Nature Biotechnology 2005, 23, 329-336....
Ligand InfoPC cidPC sid
In DepthDetails US Patent
TargetSerine/threonine-protein kinase B-raf(Homo sapiens (Human))
Ambit Biosciences
US Patent
LigandPNGBDBM333607(1-(3-(6,7- dimethoxy- quinazolin- 4- ylthio)phenyl...)
Affinity DataKd: >1.00E+3nM. Assay description: Competition binding assays used herein were developed, validated and performed as described in Fabian et al., Nature Biotechnology 2005, 23, 329-336....
Ligand InfoPC cidPC sid
In DepthDetails US Patent