BDBM333656 1-(5- isopropyl- isoxazol- 3-yl)- 3-(3-(6- methoxy-7- (2- methoxyethoxy) quinazolin- 4-yloxy)phenyl) urea::US9730937, Example 206
SMILES COCCOc1cc2ncnc(Oc3cccc(NC(=O)Nc4cc(on4)C(C)C)c3)c2cc1OC
InChI Key InChIKey=BGSJSWPBWRXPDC-UHFFFAOYSA-N
Data  3 Kd
  Tab Delimited (TSV)   2D SDfile   Computed 3D by Vconf -m prep SDfile
Find this compound or compounds like it in BindingDB:
Activity Spreadsheet -- Enzyme Inhibition Constant Data from BindingDB
Found 3 hits for monomerid = 333656
TargetSerine/threonine-protein kinase B-raf [V600E](Homo sapiens (Human))
Ambit Biosciences
US Patent
LigandPNGBDBM333656(1-(5- isopropyl- isoxazol- 3-yl)- 3-(3-(6- methoxy...)
Affinity DataKd: <250nM. Assay description: Competition binding assays used herein were developed, validated and performed as described in Fabian et al., Nature Biotechnology 2005, 23, 329-336....
Ligand InfoPC cidPC sid
In DepthDetails US Patent
TargetRAF proto-oncogene serine/threonine-protein kinase(Homo sapiens (Human))
Ambit Biosciences
US Patent
LigandPNGBDBM333656(1-(5- isopropyl- isoxazol- 3-yl)- 3-(3-(6- methoxy...)
Affinity DataKd: <250nM. Assay description: Competition binding assays used herein were developed, validated and performed as described in Fabian et al., Nature Biotechnology 2005, 23, 329-336....
Ligand InfoPC cidPC sid
In DepthDetails US Patent
TargetSerine/threonine-protein kinase B-raf(Homo sapiens (Human))
Ambit Biosciences
US Patent
LigandPNGBDBM333656(1-(5- isopropyl- isoxazol- 3-yl)- 3-(3-(6- methoxy...)
Affinity DataKd: <250nM. Assay description: Competition binding assays used herein were developed, validated and performed as described in Fabian et al., Nature Biotechnology 2005, 23, 329-336....
Ligand InfoPC cidPC sid
In DepthDetails US Patent