BDBM334137 8-(1-ethyl-5-methyl-1H-pyrazol- 4-yl)-9-methyl-6-({(3S)-1- [(trifluoromethyl)sulfonyl]pyrrol- idin-3-yl}oxy)-9H-purine::US9730940, Compound 4-3
SMILES CCn1ncc(c1C)-c1nc2c(O[C@H]3CCN(C3)S(=O)(=O)C(F)(F)F)ncnc2n1C
InChI Key InChIKey=YAAJRVOMNMWRSY-NSHDSACASA-N
Data  1 IC50
  Tab Delimited (TSV)   2D SDfile   Computed 3D by Vconf -m prep SDfile
Find this compound or compounds like it in BindingDB:
Activity Spreadsheet -- Enzyme Inhibition Constant Data from BindingDB
Found 1 hit for monomerid = 334137
TargetPhosphatidylinositol 4,5-bisphosphate 3-kinase catalytic subunit delta isoform(Homo sapiens (Human))
Merck Sharp & Dohme
US Patent
LigandPNGBDBM334137(8-(1-ethyl-5-methyl-1H-pyrazol- 4-yl)-9-methyl-6-(...)
Affinity DataIC50:  1.00E+3nM. Assay description: The PI3-Kinase biochemical assay was optimized using the HTRF kit provided by Upstate (Millipore). The assay kit contains six reagents: 1) 4× Reactio...
Ligand InfoPC cidPC sid
In DepthDetails US Patent