BDBM33451 (5-chloranylquinolin-8-yl) furan-2-carboxylate::(5-chloroquinolin-8-yl) furan-2-carboxylate::2-furancarboxylic acid (5-chloro-8-quinolinyl) ester::Furan-2-carboxylic acid 5-chloro-quinolin-8-yl ester::MLS000528333::SMR000120908::cid_699693::furan-2-carboxylic acid (5-chloro-8-quinolyl) ester
SMILES Clc1ccc(OC(=O)c2ccco2)c2ncccc12
InChI Key InChIKey=ANWBJZCIAVOROI-UHFFFAOYSA-N
Data  4 IC50
  Tab Delimited (TSV)   2D SDfile   Computed 3D by Vconf -m prep SDfile
Find this compound or compounds like it in BindingDB:
Activity Spreadsheet -- Enzyme Inhibition Constant Data from BindingDB
Found 4 hits for monomerid = 33451
TargetCoagulation factor XII(Homo sapiens (Human))
Pcmd
Curated by PubChem BioAssay
LigandPNGBDBM33451((5-chloranylquinolin-8-yl) furan-2-carboxylate | (...)
Affinity DataIC50:  2.16E+4nMpH: 7.4 T: 2°C. Assay description: HTS was performed on a total of 33,068 compounds of the MLSCN library, 23,017 of which were not in the mixture HTS plates used previously. These comp...
In DepthDetails PCBioAssay
TargetC-C chemokine receptor type 6(Homo sapiens (Human))
Burnham Center For Chemical Genomics
Curated by PubChem BioAssay
LigandPNGBDBM33451((5-chloranylquinolin-8-yl) furan-2-carboxylate | (...)
Affinity DataIC50: >6.66E+4nM. Assay description: Data Source: Sanford-Burnham Center for Chemical Genomics (SBCCG) Source Affiliation: Sanford-Burnham Medical Research Institute(SBMRI, San Diego, CA...
In DepthDetails PCBioAssay
TargetBeta-galactosidase(Escherichia coli)
Burnham Center For Chemical Genomics
Curated by PubChem BioAssay
LigandPNGBDBM33451((5-chloranylquinolin-8-yl) furan-2-carboxylate | (...)
Affinity DataIC50: >6.66E+4nM. Assay description: Data Source: Sanford-Burnham Center for Chemical Genomics (SBCCG) Source Affiliation: Sanford-Burnham Medical Research Institute(SBMRI, San Diego, C...
In DepthDetails PCBioAssay
TargetCoagulation factor XII(Homo sapiens (Human))
Pcmd
Curated by PubChem BioAssay
LigandPNGBDBM33451((5-chloranylquinolin-8-yl) furan-2-carboxylate | (...)
Affinity DataIC50:  2.16E+4nM. Assay description: Molecular Library Screening Center Network (MLSCN) Penn Center for Molecular Discovery (PCMD) Assay Provider: Scott L. Diamond, University of Pennsy...
In DepthDetails PCBioAssay